Reaction Details
TargetCarboxy-terminal domain RNA polymerase II polypeptide A small phosphatase 1
LigandBDBM82667
Substrate/Competitorn/a
Meas. Tech.Dose Response confirmation of uHTS hits for Scp-1 phosphatase using a colorimetric assay
IC50 844±130 nM
Citation PubChem, PC Dose Response confirmation of uHTS hits for Scp-1 phosphatase using a colorimetric assay PubChem Bioassay(2011)[AID]
 
Carboxy-terminal domain RNA polymerase II polypeptide A small phosphatase 1
Name:Carboxy-terminal domain RNA polymerase II polypeptide A small phosphatase 1
Type:Enzyme Catalytic Domain
Mol. Mass.:29199.89
Organism:Homo sapiens (Human)
Description:gi_10864009
Residue:261
BDBM82667
NameBDBM82667
Synonyms:(E)-N-[2-[(N''E)-N''-[1-(4-ethylphenyl)ethylidene]hydrazino]-2-keto-ethyl]-3-(2-furyl)acrylamide (E)-N-[2-[2-[1-(4-ethylphenyl)ethylidene]hydrazinyl]-2-oxidanylidene-ethyl]-3-(furan-2-yl)prop-2-enamide (E)-N-[2-[2-[1-(4-ethylphenyl)ethylidene]hydrazinyl]-2-oxoethyl]-3-(furan-2-yl)prop-2-enamide MLS000562653 SMR000174285 | cid_11957316
TypeSmall organic molecule
Emp. Form.C19H21N3O3
Mol. Mass.339.3883
SMILESCCc1ccc(cc1)C(C)=NNC(=O)CNC(=O)C=Cc1ccco1