Reaction Details
TargetCarboxy-terminal domain RNA polymerase II polypeptide A small phosphatase 1
LigandBDBM82698
Substrate/Competitorn/a
Meas. Tech.Dose Response confirmation of uHTS hits for Scp-1 phosphatase using a colorimetric assay
IC50 1800±82 nM
Citation PubChem, PC Dose Response confirmation of uHTS hits for Scp-1 phosphatase using a colorimetric assay PubChem Bioassay(2011)[AID]
 
Carboxy-terminal domain RNA polymerase II polypeptide A small phosphatase 1
Name:Carboxy-terminal domain RNA polymerase II polypeptide A small phosphatase 1
Type:Enzyme Catalytic Domain
Mol. Mass.:29199.89
Organism:Homo sapiens (Human)
Description:gi_10864009
Residue:261
BDBM82698
NameBDBM82698
Synonyms:1,3-benzodioxole-5-carboxylic acid [4-[[[(5-bromo-3-pyridinyl)-oxomethyl]hydrazinylidene]methyl]phenyl] ester MLS000573024 [4-[[(5-bromanylpyridin-3-yl)carbonylhydrazinylidene]methyl]phenyl] 1,3-benzodioxole-5-carboxylate cid_1381866 | piperonylic acid [4-[[(5-bromonicotinoyl)hydrazono]methyl]phenyl] ester
TypeSmall organic molecule
Emp. Form.C21H14BrN3O5
Mol. Mass.468.257
SMILESBrc1cncc(c1)C(=O)NN=Cc1ccc(OC(=O)c2ccc3OCOc3c2)cc1