Reaction Details
TargetCarboxy-terminal domain RNA polymerase II polypeptide A small phosphatase 1
LigandBDBM61170
Substrate/Competitorn/a
Meas. Tech.Dose Response confirmation of uHTS hits for Scp-1 phosphatase using a colorimetric assay
IC50 2000±163 nM
Citation PubChem, PC Dose Response confirmation of uHTS hits for Scp-1 phosphatase using a colorimetric assay PubChem Bioassay(2011)[AID]
 
Carboxy-terminal domain RNA polymerase II polypeptide A small phosphatase 1
Name:Carboxy-terminal domain RNA polymerase II polypeptide A small phosphatase 1
Type:Enzyme Catalytic Domain
Mol. Mass.:29199.89
Organism:Homo sapiens (Human)
Description:gi_10864009
Residue:261
BDBM61170
NameBDBM61170
Synonyms:2-oxidanyl-N-[(Z)-[2-oxidanylidene-1-(2-oxidanylidene-2-phenylazanyl-ethyl)indol-3-ylidene]amino]benzamide MLS000553637 N-[(Z)-[1-(2-anilino-2-oxoethyl)-2-oxo-3-indolylidene]amino]-2-hydroxybenzamide SMR000171357 | cid_5754238
TypeSmall organic molecule
Emp. Form.C23H18N4O4
Mol. Mass.414.4134
SMILESOc1ccccc1C(=O)N\N=C1/C(=O)N(CC(=O)Nc2ccccc2)c2ccccc12