Reaction Details
TargetCarboxy-terminal domain RNA polymerase II polypeptide A small phosphatase 1
LigandBDBM48750
Substrate/Competitorn/a
Meas. Tech.Dose Response confirmation of uHTS hits for Scp-1 phosphatase using a colorimetric assay
IC50 1777±108 nM
Citation PubChem, PC Dose Response confirmation of uHTS hits for Scp-1 phosphatase using a colorimetric assay PubChem Bioassay(2011)[AID]
 
Carboxy-terminal domain RNA polymerase II polypeptide A small phosphatase 1
Name:Carboxy-terminal domain RNA polymerase II polypeptide A small phosphatase 1
Type:Enzyme Catalytic Domain
Mol. Mass.:29199.89
Organism:Homo sapiens (Human)
Description:gi_10864009
Residue:261
BDBM48750
NameBDBM48750
Synonyms:5-bromo-2-thiophenecarboxylic acid [4-[(E)-2-(1H-benzimidazol-2-yl)-2-cyanoethenyl]phenyl] ester MLS000374996 [4-[(E)-2-(1H-benzimidazol-2-yl)-2-cyano-ethenyl]phenyl] 5-bromanylthiophene-2-carboxylate cid_6141417
TypeSmall organic molecule
Emp. Form.C21H12BrN3O2S
Mol. Mass.450.308
SMILESBrc1ccc(s1)C(=O)Oc1ccc(\C=C(/C#N)c2nc3ccccc3[nH]2)cc1