Reaction Details
TargetCarboxy-terminal domain RNA polymerase II polypeptide A small phosphatase 1
LigandBDBM82742
Substrate/Competitorn/a
Meas. Tech.Dose Response confirmation of uHTS hits for Scp-1 phosphatase using a colorimetric assay
IC50 1768±80 nM
Citation PubChem, PC Dose Response confirmation of uHTS hits for Scp-1 phosphatase using a colorimetric assay PubChem Bioassay(2011)[AID]
 
Carboxy-terminal domain RNA polymerase II polypeptide A small phosphatase 1
Name:Carboxy-terminal domain RNA polymerase II polypeptide A small phosphatase 1
Type:Enzyme Catalytic Domain
Mol. Mass.:29199.89
Organism:Homo sapiens (Human)
Description:gi_10864009
Residue:261
BDBM82742
NameBDBM82742
Synonyms:5-chloro-2-thiophenecarboxylic acid [4-[(E)-2-(1H-benzimidazol-2-yl)-2-cyanoethenyl]phenyl] ester MLS000374997 [4-[(E)-2-(1H-benzimidazol-2-yl)-2-cyano-ethenyl]phenyl] 5-chloranylthiophene-2-carboxylate cid_5767238
TypeSmall organic molecule
Emp. Form.C21H12ClN3O2S
Mol. Mass.405.857
SMILESClc1ccc(s1)C(=O)Oc1ccc(\C=C(/C#N)c2nc3ccccc3[nH]2)cc1