Reaction Details
TargetCarboxy-terminal domain RNA polymerase II polypeptide A small phosphatase 1
LigandBDBM48754
Substrate/Competitorn/a
Meas. Tech.Dose Response confirmation of uHTS hits for Scp-1 phosphatase using a colorimetric assay
IC50 711±60 nM
Citation PubChem, PC Dose Response confirmation of uHTS hits for Scp-1 phosphatase using a colorimetric assay PubChem Bioassay(2011)[AID]
 
Carboxy-terminal domain RNA polymerase II polypeptide A small phosphatase 1
Name:Carboxy-terminal domain RNA polymerase II polypeptide A small phosphatase 1
Type:Enzyme Catalytic Domain
Mol. Mass.:29199.89
Organism:Homo sapiens (Human)
Description:gi_10864009
Residue:261
BDBM48754
NameBDBM48754
Synonyms:2-(2-chlorophenyl)-N'-(2-keto-5-nitro-indol-3-yl)cinchoninohydrazide 2-(2-chlorophenyl)-N'-(5-nitro-2-oxo-3-indolyl)-4-quinolinecarbohydrazide MLS000374708 cid_6283541
TypeSmall organic molecule
Emp. Form.C24H14ClN5O4
Mol. Mass.471.852
SMILES[O-][N+](=O)c1ccc2[N-]C(=O)\C(=[NH+]/NC(=O)c3cc(nc4ccccc34)-c3ccccc3Cl)c2c1