Reaction Details
TargetCarboxy-terminal domain RNA polymerase II polypeptide A small phosphatase 1
LigandBDBM50391
Substrate/Competitorn/a
Meas. Tech.Dose Response confirmation of uHTS hits for Scp-1 phosphatase using a colorimetric assay
IC50 1455±251 nM
Citation PubChem, PC Dose Response confirmation of uHTS hits for Scp-1 phosphatase using a colorimetric assay PubChem Bioassay(2011)[AID]
 
Carboxy-terminal domain RNA polymerase II polypeptide A small phosphatase 1
Name:Carboxy-terminal domain RNA polymerase II polypeptide A small phosphatase 1
Type:Enzyme Catalytic Domain
Mol. Mass.:29199.89
Organism:Homo sapiens (Human)
Description:gi_10864009
Residue:261
BDBM50391
NameBDBM50391
Synonyms:(4Z)-3-(4-nitrophenyl)-4-[(2-nitrophenyl)hydrazinylidene]-5-oxidanylidene-pyrazole-1-carbothioamide (4Z)-3-(4-nitrophenyl)-4-[(2-nitrophenyl)hydrazinylidene]-5-oxopyrazole-1-carbothioamide MLS000703644 cid_5756838
TypeSmall organic molecule
Emp. Form.C16H11N7O5S
Mol. Mass.413.367
SMILESNC(=S)n1[n-]c(c(N=[NH+]c2ccccc2[N+]([O-])=O)c1=O)-c1ccc(cc1)[N+]([O-])=O