Reaction Details
TargetCarboxy-terminal domain RNA polymerase II polypeptide A small phosphatase 1
LigandBDBM54769
Substrate/Competitorn/a
Meas. Tech.Dose Response confirmation of uHTS hits for Scp-1 phosphatase using a colorimetric assay
IC50 5903±1176 nM
Citation PubChem, PC Dose Response confirmation of uHTS hits for Scp-1 phosphatase using a colorimetric assay PubChem Bioassay(2011)[AID]
 
Carboxy-terminal domain RNA polymerase II polypeptide A small phosphatase 1
Name:Carboxy-terminal domain RNA polymerase II polypeptide A small phosphatase 1
Type:Enzyme Catalytic Domain
Mol. Mass.:29199.89
Organism:Homo sapiens (Human)
Description:gi_10864009
Residue:261
BDBM54769
NameBDBM54769
Synonyms:4-({2-bromo-4-[(2,5-dioxo-4-imidazolidinylidene)methyl]-6-ethoxyphenoxy}methyl)benzoic acid 4-[[2-bromo-4-[(E)-(2,5-dioxo-4-imidazolidinylidene)methyl]-6-ethoxyphenoxy]methyl]benzoic acid 4-[[4-[(E)-[2,5-bis(oxidanylidene)imidazolidin-4-ylidene]methyl]-2-bromanyl-6-ethoxy-phenoxy]methyl]benzoic acid SMR000298732 | cid_1334608
TypeSmall organic molecule
Emp. Form.C20H17BrN2O6
Mol. Mass.461.263
SMILESCCOc1cc(\C=C2\NC(=O)NC2=O)cc(Br)c1OCc1ccc(cc1)C(O)=O