Reaction Details
TargetCarboxy-terminal domain RNA polymerase II polypeptide A small phosphatase 1
LigandBDBM82771
Substrate/Competitorn/a
Meas. Tech.Dose Response confirmation of uHTS hits for Scp-1 phosphatase using a colorimetric assay
IC50 632±48 nM
Citation PubChem, PC Dose Response confirmation of uHTS hits for Scp-1 phosphatase using a colorimetric assay PubChem Bioassay(2011)[AID]
 
Carboxy-terminal domain RNA polymerase II polypeptide A small phosphatase 1
Name:Carboxy-terminal domain RNA polymerase II polypeptide A small phosphatase 1
Type:Enzyme Catalytic Domain
Mol. Mass.:29199.89
Organism:Homo sapiens (Human)
Description:gi_10864009
Residue:261
BDBM82771
NameBDBM82771
Synonyms:(5E)-5-(4-methoxy-3-methyl-benzylidene)-1-methyl-2-thioxo-hexahydropyrimidine-4,6-quinone (5E)-5-[(4-methoxy-3-methylphenyl)methylidene]-1-methyl-2-sulfanylidene-1,3-diazinane-4,6-dione MLS000698824 cid_900247
TypeSmall organic molecule
Emp. Form.C14H14N2O3S
Mol. Mass.290.338
SMILESCOc1ccc(\C=C2/C(=O)NC(=S)N(C)C2=O)cc1C