Reaction Details
TargetCarboxy-terminal domain RNA polymerase II polypeptide A small phosphatase 1
LigandBDBM50529
Substrate/Competitorn/a
Meas. Tech.Dose Response confirmation of uHTS hits for Scp-1 phosphatase using a colorimetric assay
IC50 1828±59 nM
Citation PubChem, PC Dose Response confirmation of uHTS hits for Scp-1 phosphatase using a colorimetric assay PubChem Bioassay(2011)[AID]
 
Carboxy-terminal domain RNA polymerase II polypeptide A small phosphatase 1
Name:Carboxy-terminal domain RNA polymerase II polypeptide A small phosphatase 1
Type:Enzyme Catalytic Domain
Mol. Mass.:29199.89
Organism:Homo sapiens (Human)
Description:gi_10864009
Residue:261
BDBM50529
NameBDBM50529
Synonyms:(2Z)-2-(4-hydroxy-3-nitrobenzylidene)[1,3]thiazolo[3,2-a]benzimidazol-3(2H)-one 2-[(3-nitro-4-oxidanyl-phenyl)methylidene]-[1,3]thiazolo[3,2-a]benzimidazol-1-one 2-[(4-hydroxy-3-nitrophenyl)methylidene]-[1,3]thiazolo[3,2-a]benzimidazol-1-one SMR000313483 | cid_674881
TypeSmall organic molecule
Emp. Form.C16H9N3O4S
Mol. Mass.339.325
SMILESOc1ccc(\C=c2/sc3nc4ccccc4n3c2=O)cc1[N+]([O-])=O