Reaction Details
TargetCarboxy-terminal domain RNA polymerase II polypeptide A small phosphatase 1
LigandBDBM53178
Substrate/Competitorn/a
Meas. Tech.Dose Response confirmation of uHTS hits for Scp-1 phosphatase using a colorimetric assay
IC50 1552±396 nM
Citation PubChem, PC Dose Response confirmation of uHTS hits for Scp-1 phosphatase using a colorimetric assay PubChem Bioassay(2011)[AID]
 
Carboxy-terminal domain RNA polymerase II polypeptide A small phosphatase 1
Name:Carboxy-terminal domain RNA polymerase II polypeptide A small phosphatase 1
Type:Enzyme Catalytic Domain
Mol. Mass.:29199.89
Organism:Homo sapiens (Human)
Description:gi_10864009
Residue:261
BDBM53178
NameBDBM53178
Synonyms:5-(3-{(E)-[1-(2-fluorophenyl)-2,4,6-trioxotetrahydropyrimidin-5(2H)-ylidene]methyl}-2,5-dimethyl-1H-pyrrol-1-yl)isophthalic acid 5-[3-[(E)-[1-(2-fluorophenyl)-2,4,6-trioxo-1,3-diazinan-5-ylidene]methyl]-2,5-dimethyl-1-pyrrolyl]benzene-1,3-dicarboxylic acid 5-[3-[(E)-[1-(2-fluorophenyl)-2,4,6-tris(oxidanylidene)-1,3-diazinan-5-ylidene]methyl]-2,5-dimethyl-pyrrol-1-yl]benzene-1,3-dicarboxylic acid SMR000555593 | cid_1231130
TypeSmall organic molecule
Emp. Form.C25H18FN3O7
Mol. Mass.491.4247
SMILESCc1cc(C=C2C(=O)NC(=O)N(C2=O)c2ccccc2F)c(C)n1-c1cc(cc(c1)C(O)=O)C(O)=O