Reaction Details
TargetCarboxy-terminal domain RNA polymerase II polypeptide A small phosphatase 1
LigandBDBM51786
Substrate/Competitorn/a
Meas. Tech.Dose Response confirmation of uHTS hits for Scp-1 phosphatase using a colorimetric assay
IC50 737±23 nM
Citation PubChem, PC Dose Response confirmation of uHTS hits for Scp-1 phosphatase using a colorimetric assay PubChem Bioassay(2011)[AID]
 
Carboxy-terminal domain RNA polymerase II polypeptide A small phosphatase 1
Name:Carboxy-terminal domain RNA polymerase II polypeptide A small phosphatase 1
Type:Enzyme Catalytic Domain
Mol. Mass.:29199.89
Organism:Homo sapiens (Human)
Description:gi_10864009
Residue:261
BDBM51786
NameBDBM51786
Synonyms:3-[((2Z)-5-[(acetyloxy)methyl]-3-{[(2,4-dimethoxyphenyl)amino]carbonyl}-8-methyl-2H-pyrano[2,3-c]pyridin-2-ylidene)amino]benzoic acid 3-[[5-(acetyloxymethyl)-3-[(2,4-dimethoxyanilino)-oxomethyl]-8-methyl-2-pyrano[2,3-c]pyridinylidene]amino]benzoic acid 3-[[5-(acetyloxymethyl)-3-[(2,4-dimethoxyphenyl)carbamoyl]-8-methylpyrano[2,3-c]pyridin-2-ylidene]amino]benzoic acid SMR000564168 | cid_4413344
TypeSmall organic molecule
Emp. Form.C28H25N3O8
Mol. Mass.531.5134
SMILESCOc1ccc(NC(=O)c2cc3c(COC(C)=O)cnc(C)c3o\c2=N/c2cccc(c2)C(O)=O)c(OC)c1