Reaction Details
TargetToll-like receptor 9
LigandBDBM51902
Substrate/Competitorn/a
Meas. Tech.Fluorescence-based cell-based high throughput dose response assay for inhibitors of TLR9-MyD88 binding
IC50 5116±n/a nM
Citation PubChem, PC Fluorescence-based cell-based high throughput dose response assay for inhibitors of TLR9-MyD88 binding PubChem Bioassay(2011)[AID]
 
Toll-like receptor 9
Name:Toll-like receptor 9
Type:Enzyme
Mol. Mass.:115889.91
Organism:Homo sapiens (Human)
Description:Q9NR96
Residue:1032
BDBM51902
NameBDBM51902
Synonyms:MLS001203758 N-[(4-fluorophenyl)methylideneamino]-6-methoxy-2-methyl-4-quinolinamine N-[(4-fluorophenyl)methylideneamino]-6-methoxy-2-methylquinolin-4-amine [(4-fluorobenzylidene)amino]-(6-methoxy-2-methyl-4-quinolyl)amine cid_3141521
TypeSmall organic molecule
Emp. Form.C18H16FN3O
Mol. Mass.309.3375
SMILESCOc1ccc2nc(C)cc(N=NCc3ccc(F)cc3)c2c1