Reaction Details
TargetPhospholipase A2
LigandBDBM33185
Substrate/Competitorn/a
Meas. Tech.Dose response counterscreen of uHTS hits for ATG4B inhibitors in a Phospholipase A2 assay
IC50 34700±n/a nM
Citation PubChem, PC Dose response counterscreen of uHTS hits for ATG4B inhibitors in a Phospholipase A2 assay PubChem Bioassay(2011)[AID]
 
Phospholipase A2
Name:Phospholipase A2
Type:Protein
Mol. Mass.:16364.13
Organism:Homo sapiens (Human)
Description:P04054
Residue:148
BDBM33185
NameBDBM33185
Synonyms:4-({(4Z)-1-oxo-4-[(phenylsulfonyl)imino]-1,4-dihydronaphthalen-2-yl}amino)benzoic acid 4-[[(4Z)-4-besylimino-1-keto-2-naphthyl]amino]benzoic acid 4-[[4-(benzenesulfonylimino)-1-oxo-2-naphthalenyl]amino]benzoic acid MLS000686314 cid_4053104
TypeSmall organic molecule
Emp. Form.C23H16N2O5S
Mol. Mass.432.449
SMILESOC(=O)c1ccc(NC2=CC(=NS(=O)(=O)c3ccccc3)c3ccccc3C2=O)cc1