Reaction Details
TargetEndoribonuclease toxin MazF
LigandBDBM39430
Substrate/Competitorn/a
Meas. Tech.Dose response confirmation uHTS hits for MazEF TA System activators via a fluorescence-based single-stranded RNase assay
EC50>99000±n/a nM
Citation PubChem, PC Dose response confirmation uHTS hits for MazEF TA System activators via a fluorescence-based single-stranded RNase assay PubChem Bioassay(2011)[AID]
 
Endoribonuclease toxin MazF
Name:Endoribonuclease toxin MazF
Type:Enzyme Catalytic Domain
Mol. Mass.:12100.43
Organism:Escherichia coli str. K-12 substr. MG1655
Description:gi_16130689
Residue:111
BDBM39430
NameBDBM39430
Synonyms:(3-Cyano-7-methyl-quinolin-2-ylsulfanyl)-acetic acid methyl ester 2-[(3-cyano-7-methyl-2-quinolyl)thio]acetic acid methyl ester SMR000001652 methyl 2-(3-cyano-7-methyl-quinolin-2-yl)sulfanylethanoate | methyl 2-(3-cyano-7-methylquinolin-2-yl)sulfanylacetate
TypeSmall organic molecule
Emp. Form.C14H12N2O2S
Mol. Mass.272.322
SMILESCOC(=O)CSc1nc2cc(C)ccc2cc1C#N