Reaction Details
TargetEndoribonuclease toxin MazF
LigandBDBM83470
Substrate/Competitorn/a
Meas. Tech.Dose response confirmation uHTS hits for MazEF TA System activators via a fluorescence-based single-stranded RNase assay
EC50 30300±n/a nM
Citation PubChem, PC Dose response confirmation uHTS hits for MazEF TA System activators via a fluorescence-based single-stranded RNase assay PubChem Bioassay(2011)[AID]
 
Endoribonuclease toxin MazF
Name:Endoribonuclease toxin MazF
Type:Enzyme Catalytic Domain
Mol. Mass.:12100.43
Organism:Escherichia coli str. K-12 substr. MG1655
Description:gi_16130689
Residue:111
BDBM83470
NameBDBM83470
Synonyms:(3-morpholino-1-oxa-3-azonia-2-azanidacyclopent-3-en-5-ylidene)amine;hydrochloride 3-MORPHOLINOSYDNONIMINE MLS000028691 cid_9859122
TypeSmall organic molecule
Emp. Form.C6H10N4O2
Mol. Mass.170.1692
SMILES[NH-]c1c[n+](no1)N1CCOCC1