Reaction Details
TargetEndoribonuclease toxin MazF
LigandBDBM83471
Substrate/Competitorn/a
Meas. Tech.Dose response confirmation uHTS hits for MazEF TA System activators via a fluorescence-based single-stranded RNase assay
EC50 9990±n/a nM
Citation PubChem, PC Dose response confirmation uHTS hits for MazEF TA System activators via a fluorescence-based single-stranded RNase assay PubChem Bioassay(2011)[AID]
 
Endoribonuclease toxin MazF
Name:Endoribonuclease toxin MazF
Type:Enzyme Catalytic Domain
Mol. Mass.:12100.43
Organism:Escherichia coli str. K-12 substr. MG1655
Description:gi_16130689
Residue:111
BDBM83471
NameBDBM83471
Synonyms:2-cyano-N-[(4-methoxyphenyl)methyl]-2-(3-pyrrolidin-1-ylquinoxalin-2-yl)acetamide 2-cyano-N-[(4-methoxyphenyl)methyl]-2-[3-(1-pyrrolidinyl)-2-quinoxalinyl]acetamide MLS000079931 cid_659705
TypeSmall organic molecule
Emp. Form.C23H23N5O2
Mol. Mass.401.461
SMILESCOc1ccc(CNC(=O)C(C#N)c2nc3ccccc3nc2N2CCCC2)cc1