Reaction Details
TargetEndoribonuclease toxin MazF
LigandBDBM83475
Substrate/Competitorn/a
Meas. Tech.Dose response confirmation uHTS hits for MazEF TA System activators via a fluorescence-based single-stranded RNase assay
EC50>99000±n/a nM
Citation PubChem, PC Dose response confirmation uHTS hits for MazEF TA System activators via a fluorescence-based single-stranded RNase assay PubChem Bioassay(2011)[AID]
 
Endoribonuclease toxin MazF
Name:Endoribonuclease toxin MazF
Type:Enzyme Catalytic Domain
Mol. Mass.:12100.43
Organism:Escherichia coli str. K-12 substr. MG1655
Description:gi_16130689
Residue:111
BDBM83475
NameBDBM83475
Synonyms:2-(9-methoxy-6-indolo[3,2-b]quinoxalinyl)acetic acid methyl ester MLS000040504 cid_662646 methyl 2-(9-methoxyindolo[3,2-b]quinoxalin-6-yl)ethanoate
TypeSmall organic molecule
Emp. Form.C18H15N3O3
Mol. Mass.321.33
SMILESCOC(=O)Cn1c2ccc(OC)cc2c2nc3ccccc3nc12