Reaction Details
TargetEndoribonuclease toxin MazF
LigandBDBM83242
Substrate/Competitorn/a
Meas. Tech.Dose response confirmation uHTS hits for MazEF TA System activators via a fluorescence-based single-stranded RNase assay
EC50 12000±n/a nM
Citation PubChem, PC Dose response confirmation uHTS hits for MazEF TA System activators via a fluorescence-based single-stranded RNase assay PubChem Bioassay(2011)[AID]
 
Endoribonuclease toxin MazF
Name:Endoribonuclease toxin MazF
Type:Enzyme Catalytic Domain
Mol. Mass.:12100.43
Organism:Escherichia coli str. K-12 substr. MG1655
Description:gi_16130689
Residue:111
BDBM83242
NameBDBM83242
Synonyms:MLS000859743 [4-amino-3-(2-piperidin-1-ylethylsulfanyl)thieno[2,3-c][1,2]thiazol-5-yl]-thiophen-2-ylmethanone [4-amino-3-[2-(1-piperidinyl)ethylthio]-5-thieno[2,3-c]isothiazolyl]-thiophen-2-ylmethanone cid_2816883 | {4-amino-3-[(2-piperidinoethyl)sulfanyl]thieno[2,3-c]isothiazol-5-yl}(2-thienyl)methanone
TypeSmall organic molecule
Emp. Form.C17H19N3OS4
Mol. Mass.409.612
SMILESNc1c(sc2nsc(SCCN3CCCCC3)c12)C(=O)c1cccs1