Reaction Details
TargetEndoribonuclease toxin MazF
LigandBDBM45195
Substrate/Competitorn/a
Meas. Tech.Dose response confirmation uHTS hits for MazEF TA System activators via a fluorescence-based single-stranded RNase assay counterscreen
EC50 271±n/a nM
Citation PubChem, PC Dose response confirmation uHTS hits for MazEF TA System activators via a fluorescence-based single-stranded RNase assay counterscreen PubChem Bioassay(2011)[AID]
 
Endoribonuclease toxin MazF
Name:Endoribonuclease toxin MazF
Type:Enzyme Catalytic Domain
Mol. Mass.:12100.43
Organism:Escherichia coli str. K-12 substr. MG1655
Description:gi_16130689
Residue:111
BDBM45195
NameBDBM45195
Synonyms:4-[(3aS,6aS)-4,6-Dioxo-3-(quinoline-2-carbonyl)-3a,4,6,6a-tetrahydro-1H-pyrrolo[3,4-c]pyrazol-5-yl]-benzonitrile 4-[(3aS,6aS)-4,6-diketo-3-quinaldoyl-3a,6a-dihydro-1H-pyrrolo[3,4-c]pyrazol-5-yl]benzonitrile 4-[(3aS,6aS)-4,6-dioxo-3-[oxo(2-quinolinyl)methyl]-3a,6a-dihydro-1H-pyrrolo[3,4-c]pyrazol-5-yl]benzonitrile SMR000212884 | cid_11901259
TypeSmall organic molecule
Emp. Form.C22H13N5O3
Mol. Mass.395.3703
SMILESOc1n(-c2ccc(cc2)C#N)c(=O)c2c([nH][nH]c12)C(=O)c1ccc2ccccc2n1