Reaction Details
TargetOrotidine 5'-phosphate decarboxylase
LigandBDBM83819
Substrate/Competitorn/a
Meas. Tech.Luminescence-based cell-based high throughput dose response assay for activators of the GAA850 frataxin (FXN) promoter
EC50>59654±n/a nM
Citation PubChem, PC Luminescence-based cell-based high throughput dose response assay for activators of the GAA850 frataxin (FXN) promoter PubChem Bioassay(2011)[AID]
 
Orotidine 5'-phosphate decarboxylase
Name:Orotidine 5'-phosphate decarboxylase
Type:Enzyme Catalytic Domain
Mol. Mass.:30195.13
Organism:Aspergillus niger
Description:gi_2395
Residue:277
BDBM83819
NameBDBM83819
Synonyms:MLS001146635 N-[[(Z)-2-bromo-3-phenyl-prop-2-enylidene]amino]-5-isopropyl-1H-pyrazole-3-carboxamide SMR000646711 | cid_1539367
TypeSmall organic molecule
Emp. Form.C16H17BrN4O
Mol. Mass.361.236
SMILESCC(C)c1cc([nH]n1)C(=O)NN=CC(Br)=Cc1ccccc1