Reaction Details
TargetOrotidine 5'-phosphate decarboxylase
LigandBDBM44965
Substrate/Competitorn/a
Meas. Tech.Luminescence-based cell-based high throughput dose response assay for activators of the GAA850 frataxin (FXN) promoter
EC50>59652±n/a nM
Citation PubChem, PC Luminescence-based cell-based high throughput dose response assay for activators of the GAA850 frataxin (FXN) promoter PubChem Bioassay(2011)[AID]
 
Orotidine 5'-phosphate decarboxylase
Name:Orotidine 5'-phosphate decarboxylase
Type:Enzyme Catalytic Domain
Mol. Mass.:30195.13
Organism:Aspergillus niger
Description:gi_2395
Residue:277
BDBM44965
NameBDBM44965
Synonyms:5-acetoxy-2-[(amidinothio)methyl]-6-bromo-1-(p-tolyl)indole-3-carboxylic acid ethyl ester;hydrobromide MLS000545873 cid_11948870 ethyl 5-acetyloxy-6-bromanyl-2-(carbamimidoylsulfanylmethyl)-1-(4-methylphenyl)indole-3-carboxylate;hydrobromide | ethyl 5-acetyloxy-6-bromo-2-(carbamimidoylsulfanylmethyl)-1-(4-methylphenyl)indole-3-carboxylate;hydrobromide
TypeSmall organic molecule
Emp. Form.C22H22BrN3O4S
Mol. Mass.504.397
SMILESCCOC(=O)c1c(CSC(N)=N)n(-c2ccc(C)cc2)c2cc(Br)c(OC(C)=O)cc12