Reaction Details
TargetOrotidine 5'-phosphate decarboxylase
LigandBDBM83826
Substrate/Competitorn/a
Meas. Tech.Luminescence-based cell-based high throughput dose response assay for activators of the GAA850 frataxin (FXN) promoter
EC50>59718±n/a nM
Citation PubChem, PC Luminescence-based cell-based high throughput dose response assay for activators of the GAA850 frataxin (FXN) promoter PubChem Bioassay(2011)[AID]
 
Orotidine 5'-phosphate decarboxylase
Name:Orotidine 5'-phosphate decarboxylase
Type:Enzyme Catalytic Domain
Mol. Mass.:30195.13
Organism:Aspergillus niger
Description:gi_2395
Residue:277
BDBM83826
NameBDBM83826
Synonyms:(2S)-2-[[[(2R)-1-ethoxy-1-oxopropan-2-yl]-[(4-methoxyphenyl)methyl]sulfamoyl]-(phenylmethyl)amino]-3-methylbutanoic acid methyl ester MLS002240571 cid_42628460 methyl (2S)-2-[benzyl-[[(2R)-1-ethoxy-1-oxopropan-2-yl]-[(4-methoxyphenyl)methyl]sulfamoyl]amino]-3-methylbutanoate
TypeSmall organic molecule
Emp. Form.C26H36N2O7S
Mol. Mass.520.638
SMILESCCOC(=O)[C@@H](C)N(Cc1ccc(OC)cc1)S(=O)(=O)N(Cc1ccccc1)[C@@H](C(C)C)C(=O)OC