Reaction Details
TargetOrotidine 5'-phosphate decarboxylase
LigandBDBM83828
Substrate/Competitorn/a
Meas. Tech.Luminescence-based cell-based high throughput dose response assay for activators of the GAA850 frataxin (FXN) promoter
EC50>59638±n/a nM
Citation PubChem, PC Luminescence-based cell-based high throughput dose response assay for activators of the GAA850 frataxin (FXN) promoter PubChem Bioassay(2011)[AID]
 
Orotidine 5'-phosphate decarboxylase
Name:Orotidine 5'-phosphate decarboxylase
Type:Enzyme Catalytic Domain
Mol. Mass.:30195.13
Organism:Aspergillus niger
Description:gi_2395
Residue:277
BDBM83828
NameBDBM83828
Synonyms:MLS002245437 N-[3-(diethylsulfamoyl)-4-methyl-phenyl]-2-[(3,5-dimethylisoxazol-4-yl)methylthio]acetamide N-[3-(diethylsulfamoyl)-4-methylphenyl]-2-[(3,5-dimethyl-4-isoxazolyl)methylthio]acetamide cid_4963639
TypeSmall organic molecule
Emp. Form.C19H27N3O4S2
Mol. Mass.425.565
SMILESCCN(CC)S(=O)(=O)c1cc(NC(=O)CSCc2c(C)noc2C)ccc1C