Reaction Details
TargetOrotidine 5'-phosphate decarboxylase
LigandBDBM51519
Substrate/Competitorn/a
Meas. Tech.Luminescence-based cell-based high throughput dose response assay for activators of the GAA850 frataxin (FXN) promoter
EC50>59644±n/a nM
Citation PubChem, PC Luminescence-based cell-based high throughput dose response assay for activators of the GAA850 frataxin (FXN) promoter PubChem Bioassay(2011)[AID]
 
Orotidine 5'-phosphate decarboxylase
Name:Orotidine 5'-phosphate decarboxylase
Type:Enzyme Catalytic Domain
Mol. Mass.:30195.13
Organism:Aspergillus niger
Description:gi_2395
Residue:277
BDBM51519
NameBDBM51519
Synonyms:9,10-dimethoxy-2-(3-pyridinylmethoxy)-6,7-dihydropyrimido[6,1-a]isoquinolin-4-one 9,10-dimethoxy-2-(pyridin-3-ylmethoxy)-6,7-dihydropyrimido[6,1-a]isoquinolin-4-one SMR000047302 | cid_666145
TypeSmall organic molecule
Emp. Form.C20H19N3O4
Mol. Mass.365.3826
SMILESCOc1cc2CCn3c(cc(OCc4cccnc4)nc3=O)-c2cc1OC