Reaction Details
TargetOrotidine 5'-phosphate decarboxylase
LigandBDBM83838
Substrate/Competitorn/a
Meas. Tech.Luminescence-based cell-based high throughput dose response assay for activators of the GAA850 frataxin (FXN) promoter
EC50>59661±n/a nM
Citation PubChem, PC Luminescence-based cell-based high throughput dose response assay for activators of the GAA850 frataxin (FXN) promoter PubChem Bioassay(2011)[AID]
 
Orotidine 5'-phosphate decarboxylase
Name:Orotidine 5'-phosphate decarboxylase
Type:Enzyme Catalytic Domain
Mol. Mass.:30195.13
Organism:Aspergillus niger
Description:gi_2395
Residue:277
BDBM83838
NameBDBM83838
Synonyms:1,1-dimethyl-3-[4-(phenylmethyl)-5-sulfanylidene-1,2,4-dithiazolidin-3-ylidene]thiourea 3-(4-benzyl-5-thioxo-1,2,4-dithiazolidin-3-ylidene)-1,1-dimethyl-thiourea SMR001565152 | cid_371398
TypeSmall organic molecule
Emp. Form.C12H13N3S4
Mol. Mass.327.512
SMILESCN(C)C(=S)N=c1ssc(=S)n1Cc1ccccc1