Reaction Details
TargetOrotidine 5'-phosphate decarboxylase
LigandBDBM50154618
Substrate/Competitorn/a
Meas. Tech.Luminescence-based cell-based high throughput dose response assay for activators of the GAA850 frataxin (FXN) promoter
EC50>59587±n/a nM
Citation PubChem, PC Luminescence-based cell-based high throughput dose response assay for activators of the GAA850 frataxin (FXN) promoter PubChem Bioassay(2011)[AID]
 
Orotidine 5'-phosphate decarboxylase
Name:Orotidine 5'-phosphate decarboxylase
Type:Enzyme Catalytic Domain
Mol. Mass.:30195.13
Organism:Aspergillus niger
Description:gi_2395
Residue:277
BDBM50154618
NameBDBM50154618
Synonyms:5-Bromo-3-(2-oxo-2-phenyl-ethylidene)-1,3-dihydro-indol-2-one CHEMBL363491 | cid_5477132
TypeSmall organic molecule
Emp. Form.C16H10BrNO2
Mol. Mass.328.16
SMILESBrc1ccc2NC(=O)\C(=C/C(=O)c3ccccc3)c2c1