Reaction Details
TargetOrotidine 5'-phosphate decarboxylase
LigandBDBM83851
Substrate/Competitorn/a
Meas. Tech.Luminescence-based cell-based high throughput dose response assay for activators of the GAA850 frataxin (FXN) promoter
EC50>59608±n/a nM
Citation PubChem, PC Luminescence-based cell-based high throughput dose response assay for activators of the GAA850 frataxin (FXN) promoter PubChem Bioassay(2011)[AID]
 
Orotidine 5'-phosphate decarboxylase
Name:Orotidine 5'-phosphate decarboxylase
Type:Enzyme Catalytic Domain
Mol. Mass.:30195.13
Organism:Aspergillus niger
Description:gi_2395
Residue:277
BDBM83851
NameBDBM83851
Synonyms:3,3-bis(benzenesulfonyl)propanoic acid tert-butyl ester MLS002920080 cid_279782 tert-butyl 3,3-bis(phenylsulfonyl)propanoate
TypeSmall organic molecule
Emp. Form.C19H22O6S2
Mol. Mass.410.504
SMILESCC(C)(C)OC(=O)CC(S(=O)(=O)c1ccccc1)S(=O)(=O)c1ccccc1