Reaction Details
TargetOrotidine 5'-phosphate decarboxylase
LigandBDBM50151720
Substrate/Competitorn/a
Meas. Tech.Luminescence-based cell-based high throughput dose response assay for activators of the GAA850 frataxin (FXN) promoter
EC50>59600±n/a nM
Citation PubChem, PC Luminescence-based cell-based high throughput dose response assay for activators of the GAA850 frataxin (FXN) promoter PubChem Bioassay(2011)[AID]
 
Orotidine 5'-phosphate decarboxylase
Name:Orotidine 5'-phosphate decarboxylase
Type:Enzyme Catalytic Domain
Mol. Mass.:30195.13
Organism:Aspergillus niger
Description:gi_2395
Residue:277
BDBM50151720
NameBDBM50151720
Synonyms:ARFORMOTEROL TARTRATE CHEMBL605993 FORMOTEROL FUMARATE N-(2-Hydroxy-5-{1-hydroxy-2-[2-(4-methoxy-phenyl)-1-methyl-ethylamino]-ethyl}-phenyl)-formamide Symbicort | cid_9912089
TypeSmall organic molecule
Emp. Form.C19H24N2O4
Mol. Mass.344.4049
SMILESCOc1ccc(C[C@@H](C)NC[C@H](O)c2ccc(O)c(NC=O)c2)cc1