Reaction Details
TargetApoptotic protease-activating factor 1
LigandBDBM41038
Substrate/Competitorn/a
Meas. Tech.Dose response confirmation of uHTS hits for Apaf-1 in a Fluorescent assay
IC50 335±n/a nM
Citation PubChem, PC Dose response confirmation of uHTS hits for Apaf-1 in a Fluorescent assay PubChem Bioassay(2011)[AID]
 
Apoptotic protease-activating factor 1
Name:Apoptotic protease-activating factor 1
Type:Enzyme Catalytic Domain
Mol. Mass.:141834.40
Organism:Homo sapiens (Human)
Description:O14727
Residue:1248
BDBM41038
NameBDBM41038
Synonyms:(NE)-N-[3-(2-methylanilino)-4-oxo-1-naphthalenylidene]-2-thiophenesulfonamide (NE)-N-[3-[(2-methylphenyl)amino]-4-oxidanylidene-naphthalen-1-ylidene]thiophene-2-sulfonamide MLS000536576 cid_11834470
TypeSmall organic molecule
Emp. Form.C21H16N2O3S2
Mol. Mass.408.493
SMILESCc1ccccc1NC1=CC(=NS(=O)(=O)c2cccs2)c2ccccc2C1=O