Reaction Details
TargetApoptotic protease-activating factor 1
LigandBDBM64782
Substrate/Competitorn/a
Meas. Tech.Dose response confirmation of uHTS hits for Apaf-1 in a Fluorescent assay
IC50 1030±n/a nM
Citation PubChem, PC Dose response confirmation of uHTS hits for Apaf-1 in a Fluorescent assay PubChem Bioassay(2011)[AID]
 
Apoptotic protease-activating factor 1
Name:Apoptotic protease-activating factor 1
Type:Enzyme Catalytic Domain
Mol. Mass.:141834.40
Organism:Homo sapiens (Human)
Description:O14727
Residue:1248
BDBM64782
NameBDBM64782
Synonyms:(6E)-6-[[2-(2,6-dipyrrolidin-1-ylpyrimidin-4-yl)hydrazinyl]methylidene]cyclohexa-2,4-dien-1-one (6E)-6-[[[2,6-bis(1-pyrrolidinyl)-4-pyrimidinyl]hydrazo]methylidene]-1-cyclohexa-2,4-dienone MLS000577672 cid_6614484
TypeSmall organic molecule
Emp. Form.C19H24N6O
Mol. Mass.352.4335
SMILESOc1ccccc1CN=Nc1cc(nc(n1)N1CCCC1)N1CCCC1