Reaction Details
TargetApoptotic protease-activating factor 1
LigandBDBM83913
Substrate/Competitorn/a
Meas. Tech.Dose response confirmation of uHTS hits for Apaf-1 in a Fluorescent assay
IC50 798±n/a nM
Citation PubChem, PC Dose response confirmation of uHTS hits for Apaf-1 in a Fluorescent assay PubChem Bioassay(2011)[AID]
 
Apoptotic protease-activating factor 1
Name:Apoptotic protease-activating factor 1
Type:Enzyme Catalytic Domain
Mol. Mass.:141834.40
Organism:Homo sapiens (Human)
Description:O14727
Residue:1248
BDBM83913
NameBDBM83913
Synonyms:4-Chloro-3-nitro-benzoic acid N'-(3-1,2,3,4-tetrahydro-carbazol-9-yl-propionyl)-hydrazide 4-chloro-3-nitro-N'-[1-oxo-3-(1,2,3,4-tetrahydrocarbazol-9-yl)propyl]benzohydrazide MLS000590908 cid_4422714
TypeSmall organic molecule
Emp. Form.C22H21ClN4O4
Mol. Mass.440.88
SMILES[O-][N+](=O)c1cc(ccc1Cl)C(=O)NNC(=O)CCn1c2CCCCc2c2ccccc12