Reaction Details
TargetApoptotic protease-activating factor 1
LigandBDBM58032
Substrate/Competitorn/a
Meas. Tech.Dose response confirmation of uHTS hits for Apaf-1 in a Fluorescent assay
IC50>100000±n/a nM
Citation PubChem, PC Dose response confirmation of uHTS hits for Apaf-1 in a Fluorescent assay PubChem Bioassay(2011)[AID]
 
Apoptotic protease-activating factor 1
Name:Apoptotic protease-activating factor 1
Type:Enzyme Catalytic Domain
Mol. Mass.:141834.40
Organism:Homo sapiens (Human)
Description:O14727
Residue:1248
BDBM58032
NameBDBM58032
Synonyms:2-(1,3-Dioxo-indan-2-yl)-2-(2-methyl-1H-indol-3-yl)-malononitrile 2-(1,3-dioxo-2-indenyl)-2-(2-methyl-1H-indol-3-yl)propanedinitrile 2-[1,3-bis(oxidanylidene)inden-2-yl]-2-(2-methyl-1H-indol-3-yl)propanedinitrile SMR000416004 cid_582632
TypeSmall organic molecule
Emp. Form.C21H13N3O2
Mol. Mass.339.3468
SMILESCc1[nH]c2ccccc2c1C(C#N)(C#N)C1C(=O)c2ccccc2C1=O