Reaction Details
TargetApoptotic protease-activating factor 1
LigandBDBM64790
Substrate/Competitorn/a
Meas. Tech.Dose response confirmation of uHTS hits for Apaf-1 in a Fluorescent assay
IC50 2550±n/a nM
Citation PubChem, PC Dose response confirmation of uHTS hits for Apaf-1 in a Fluorescent assay PubChem Bioassay(2011)[AID]
 
Apoptotic protease-activating factor 1
Name:Apoptotic protease-activating factor 1
Type:Enzyme Catalytic Domain
Mol. Mass.:141834.40
Organism:Homo sapiens (Human)
Description:O14727
Residue:1248
BDBM64790
NameBDBM64790
Synonyms:3a,8b-Dihydroxy-2-methyl-4-oxo-4,8b-dihydro-3aH-indeno[1,2-b]furan-3-carboxylic acid ethyl ester 3a,8b-dihydroxy-4-keto-2-methyl-indeno[1,2-b]furan-3-carboxylic acid ethyl ester SMR000431569 ethyl 2-methyl-3a,8b-bis(oxidanyl)-4-oxidanylidene-indeno[1,2-b]furan-3-carboxylate | ethyl 3a,8b-dihydroxy-2-methyl-4-oxoindeno[1,2-b]furan-3-carboxylate
TypeSmall organic molecule
Emp. Form.C15H14O6
Mol. Mass.290.2681
SMILESCCOC(=O)C1=C(C)OC2(O)c3ccccc3C(=O)C12O