Reaction Details
TargetApoptotic protease-activating factor 1
LigandBDBM64030
Substrate/Competitorn/a
Meas. Tech.Dose response confirmation of uHTS hits for Apaf-1 in a Fluorescent assay
IC50 1380±n/a nM
Citation PubChem, PC Dose response confirmation of uHTS hits for Apaf-1 in a Fluorescent assay PubChem Bioassay(2011)[AID]
 
Apoptotic protease-activating factor 1
Name:Apoptotic protease-activating factor 1
Type:Enzyme Catalytic Domain
Mol. Mass.:141834.40
Organism:Homo sapiens (Human)
Description:O14727
Residue:1248
BDBM64030
NameBDBM64030
Synonyms:3-Amino-6,6-dimethyl-2-phenyl-2,8-dihydro-6H-pyrano[3,4-c]pyridazine-4-carbonitrile 3-azanyl-6,6-dimethyl-2-phenyl-8H-pyrano[3,4-c]pyridazine-4-carbonitrile SMR000513314 | cid_738951
TypeSmall organic molecule
Emp. Form.C16H16N4O
Mol. Mass.280.3244
SMILESCC1(C)Cc2c(CO1)nn(-c1ccccc1)c(=N)c2C#N