Reaction Details
TargetApoptotic protease-activating factor 1
LigandBDBM48027
Substrate/Competitorn/a
Meas. Tech.Dose Response validation of Inhibitors of Apaf-1 using a Fluorescent Interference Counterscreen assay
IC50>100000±0 nM
Citation PubChem, PC Dose Response validation of Inhibitors of Apaf-1 using a Fluorescent Interference Counterscreen assay PubChem Bioassay(2011)[AID]
 
Apoptotic protease-activating factor 1
Name:Apoptotic protease-activating factor 1
Type:Enzyme Catalytic Domain
Mol. Mass.:141834.40
Organism:Homo sapiens (Human)
Description:O14727
Residue:1248
BDBM48027
NameBDBM48027
Synonyms:4-[[(4E)-1-keto-4-mesitylsulfonylimino-2-naphthyl]amino]benzoic acid 4-[[(4E)-1-oxo-4-(2,4,6-trimethylphenyl)sulfonylimino-2-naphthalenyl]amino]benzoic acid MLS000948031 cid_9609431
TypeSmall organic molecule
Emp. Form.C26H22N2O5S
Mol. Mass.474.528
SMILESCc1cc(C)c(c(C)c1)S(=O)(=O)N=C1C=C(Nc2ccc(cc2)C(O)=O)C(=O)c2ccccc12