Reaction Details
TargetCaspase-9
LigandBDBM48039
Substrate/Competitorn/a
Meas. Tech.Dose response confirmation of uHTS hits for Apaf-1 using a LZ-Caspase-9/Caspase-3 Fluorescent Selectivity assay
IC50 4150±n/a nM
Citation PubChem, PC Dose response confirmation of uHTS hits for Apaf-1 using a LZ-Caspase-9/Caspase-3 Fluorescent Selectivity assay PubChem Bioassay(2011)[AID]
 
Caspase-9
Name:Caspase-9
Type:Enzyme
Mol. Mass.:46277.29
Organism:Homo sapiens (Human)
Description:n/a
Residue:416
BDBM48039
NameBDBM48039
Synonyms:3-[[(4E)-4-(2,4-dimethylphenyl)sulfonylimino-1-keto-2-naphthyl]amino]benzoic acid 3-[[(4E)-4-(2,4-dimethylphenyl)sulfonylimino-1-oxo-2-naphthalenyl]amino]benzoic acid MLS000948061 cid_5824726
TypeSmall organic molecule
Emp. Form.C25H20N2O5S
Mol. Mass.460.502
SMILESCc1ccc(c(C)c1)S(=O)(=O)N=C1C=C(Nc2cccc(c2)C(O)=O)C(=O)c2ccccc12