Reaction Details
TargetCaspase-9
LigandBDBM59083
Substrate/Competitorn/a
Meas. Tech.Dose response confirmation of uHTS hits for Apaf-1 using a LZ-Caspase-9/Caspase-3 Fluorescent Selectivity assay
IC50 84500±n/a nM
Citation PubChem, PC Dose response confirmation of uHTS hits for Apaf-1 using a LZ-Caspase-9/Caspase-3 Fluorescent Selectivity assay PubChem Bioassay(2011)[AID]
 
Caspase-9
Name:Caspase-9
Type:Enzyme
Mol. Mass.:46277.29
Organism:Homo sapiens (Human)
Description:n/a
Residue:416
BDBM59083
NameBDBM59083
Synonyms:MLS002154065 THONZONIUM BROMIDE cid_11102
TypeSmall organic molecule
Emp. Form.C32H55N4O
Mol. Mass.511.8048
[N+](C)(C)CCN(Cc1ccc(OC)cc1)c1ncccn1