Reaction Details
TargetMultidrug efflux pump
LigandBDBM33060
Substrate/Competitorn/a
Meas. Tech.Dose Response HTS singleplex for inhibitors of yeast efflux pump, specifically Mdr1 with Hit compounds from Cherry Pick1
EC50 6140±n/a nM
Citation PubChem, PC Dose Response HTS singleplex for inhibitors of yeast efflux pump, specifically Mdr1 with Hit compounds from Cherry Pick1 PubChem Bioassay(2011)[AID]
 
Multidrug efflux pump
Name:Multidrug efflux pump
Synonyms:Candida albicans strain ATCC 10261 multidrug efflux pump (MDR1) gene, MDR1-A allele, complete cds
Type:Enzyme Catalytic Domain
Mol. Mass.:62915.82
Organism:Candida albicans
Description:Q09GR2
Residue:564
BDBM33060
NameBDBM33060
TypeSmall organic molecule
Emp. Form.C15H14N2OS
Mol. Mass.270.349
SMILESCc1ccc(o1)-c1c2CCCCc2[nH]c(=S)c1C#N