Reaction Details
TargetMultidrug efflux pump
LigandBDBM56422
Substrate/Competitorn/a
Meas. Tech.Dose Response HTS singleplex for inhibitors of yeast efflux pump, specifically Mdr1 with Hit compounds from Cherry Pick1
EC50 23000±n/a nM
Citation PubChem, PC Dose Response HTS singleplex for inhibitors of yeast efflux pump, specifically Mdr1 with Hit compounds from Cherry Pick1 PubChem Bioassay(2011)[AID]
 
Multidrug efflux pump
Name:Multidrug efflux pump
Synonyms:Candida albicans strain ATCC 10261 multidrug efflux pump (MDR1) gene, MDR1-A allele, complete cds
Type:Enzyme Catalytic Domain
Mol. Mass.:62915.82
Organism:Candida albicans
Description:Q09GR2
Residue:564
BDBM56422
NameBDBM56422
TypeSmall organic molecule
Emp. Form.C23H14ClF3N2O3
Mol. Mass.458.817
SMILESFC(F)(F)c1cnc(NC(=O)COC(=O)c2c3ccccc3cc3ccccc23)c(Cl)c1