Reaction Details
TargetMultidrug efflux pump
LigandBDBM50957
Substrate/Competitorn/a
Meas. Tech.Dose Response HTS singleplex for inhibitors of yeast efflux pump, specifically Mdr1 with Hit compounds from Cherry Pick1
EC50 5120±n/a nM
Citation PubChem, PC Dose Response HTS singleplex for inhibitors of yeast efflux pump, specifically Mdr1 with Hit compounds from Cherry Pick1 PubChem Bioassay(2011)[AID]
 
Multidrug efflux pump
Name:Multidrug efflux pump
Synonyms:Candida albicans strain ATCC 10261 multidrug efflux pump (MDR1) gene, MDR1-A allele, complete cds
Type:Enzyme Catalytic Domain
Mol. Mass.:62915.82
Organism:Candida albicans
Description:Q09GR2
Residue:564
BDBM50957
NameBDBM50957
TypeSmall organic molecule
Emp. Form.C19H17NO3S
Mol. Mass.339.408
SMILESCOc1ccc(\C=C2/SC(=NC2=O)c2ccc(C)cc2)cc1OC