Reaction Details
TargetMultidrug efflux pump
LigandBDBM84142
Substrate/Competitorn/a
Meas. Tech.Dose Response HTS singleplex for inhibitors of yeast efflux pump, specifically Mdr1 with Hit compounds from Cherry Pick1
EC50 10±n/a nM
Citation PubChem, PC Dose Response HTS singleplex for inhibitors of yeast efflux pump, specifically Mdr1 with Hit compounds from Cherry Pick1 PubChem Bioassay(2011)[AID]
 
Multidrug efflux pump
Name:Multidrug efflux pump
Synonyms:Candida albicans strain ATCC 10261 multidrug efflux pump (MDR1) gene, MDR1-A allele, complete cds
Type:Enzyme Catalytic Domain
Mol. Mass.:62915.82
Organism:Candida albicans
Description:Q09GR2
Residue:564
BDBM84142
NameBDBM84142
TypeSmall organic molecule
Emp. Form.C26H22N4O3S
Mol. Mass.470.543
SMILESCc1cccc(C)c1-n1c(SCC(=O)N2CC(=O)Nc3ccccc23)nc2ccccc2c1=O