Reaction Details
TargetMultidrug efflux pump
LigandBDBM84125
Substrate/Competitorn/a
Meas. Tech.Dose Response HTS singleplex for inhibitors of yeast efflux pump, specifically Mdr1 with Hit compounds from Cherry Pick1
EC50 10600±n/a nM
Citation PubChem, PC Dose Response HTS singleplex for inhibitors of yeast efflux pump, specifically Mdr1 with Hit compounds from Cherry Pick1 PubChem Bioassay(2011)[AID]
 
Multidrug efflux pump
Name:Multidrug efflux pump
Synonyms:Candida albicans strain ATCC 10261 multidrug efflux pump (MDR1) gene, MDR1-A allele, complete cds
Type:Enzyme Catalytic Domain
Mol. Mass.:62915.82
Organism:Candida albicans
Description:Q09GR2
Residue:564
BDBM84125
NameBDBM84125
TypeSmall organic molecule
Emp. Form.C30H33NO4S
Mol. Mass.503.652
SMILESCOc1ccc2sc(c(-c3ccc(OCCN4CCCCC4)cc3)c2c1)-c1cc(OC)cc(OC)c1