Reaction Details
TargetToll-like receptor 9
LigandBDBM273234
Substrate/Competitorn/a
Meas. Tech.TLR7/8/9 Inhibition Reporter Assay
Temperature298.15±n/a K
IC50 1172±n/a nM
Commentsextracted
Citation Dyckman, AJDodd, DSMacor, JEMussari, CPPasunoori, LKumar, SRSherwood, TCSistla, RK [1,2,4]triazolo[1,5-a]pyridinyl substituted indole compounds US Patent US10071079 Publication Date 9/11/2018
 
Toll-like receptor 9
Name:Toll-like receptor 9
Type:Enzyme
Mol. Mass.:115889.91
Organism:Homo sapiens (Human)
Description:Q9NR96
Residue:1032
BDBM273234
NameBDBM273234
Synonyms:US10071079, Example 8
TypeSmall organic molecule
Emp. Form.C25H28N6
Mol. Mass.412.53
SMILESCC(C)c1c([nH]c2ccc(cc12)C1CCN(C[N+]#[C-])CC1)-c1cc(C)c2ncnn2c1