Reaction Details
TargetToll-like receptor 9
LigandBDBM273255
Substrate/Competitorn/a
Meas. Tech.TLR7/8/9 Inhibition Reporter Assay
Temperature298.15±n/a K
IC50 1159±n/a nM
Commentsextracted
Citation Dyckman, AJDodd, DSMacor, JEMussari, CPPasunoori, LKumar, SRSherwood, TCSistla, RK [1,2,4]triazolo[1,5-a]pyridinyl substituted indole compounds US Patent US10071079 Publication Date 9/11/2018
 
Toll-like receptor 9
Name:Toll-like receptor 9
Type:Enzyme
Mol. Mass.:115889.91
Organism:Homo sapiens (Human)
Description:Q9NR96
Residue:1032
BDBM273255
NameBDBM273255
Synonyms:US10071079, Example 29 | US10478424, Example 29
TypeSmall organic molecule
Emp. Form.C27H35N5
Mol. Mass.429.6003
SMILESCC(C)CN1CCC(CC1)c1ccc2[nH]c(c(C(C)C)c2c1)-c1cc(C)c2ncnn2c1