Reaction Details
TargetToll-like receptor 9
LigandBDBM273271
Substrate/Competitorn/a
Meas. Tech.TLR7/8/9 Inhibition Reporter Assay
Temperature298.15±n/a K
IC50 1757±n/a nM
Commentsextracted
Citation Dyckman, AJDodd, DSMacor, JEMussari, CPPasunoori, LKumar, SRSherwood, TCSistla, RK [1,2,4]triazolo[1,5-a]pyridinyl substituted indole compounds US Patent US10071079 Publication Date 9/11/2018
 
Toll-like receptor 9
Name:Toll-like receptor 9
Type:Enzyme
Mol. Mass.:115889.91
Organism:Homo sapiens (Human)
Description:Q9NR96
Residue:1032
BDBM273271
NameBDBM273271
Synonyms:US10071079, Example 45 | US10478424, Example 45
TypeSmall organic molecule
Emp. Form.C28H35N5O2
Mol. Mass.473.6098
SMILESCOc1cc(cn2ncnc12)-c1[nH]c2ccc(cc2c1C(C)C)C1CCN(CC1)C1CCOCC1