Reaction Details
TargetToll-like receptor 7
LigandBDBM273784
Substrate/Competitorn/a
Meas. Tech.TLR7/8/9 Inhibition Reporter Assay
Temperature298.15±n/a K
IC50 0.400±n/a nM
Commentsextracted
Citation Dyckman, AJDodd, DSMacor, JEMussari, CPPasunoori, LKumar, SRSherwood, TCSistla, RK [1,2,4]triazolo[1,5-a]pyridinyl substituted indole compounds US Patent US10071079 Publication Date 9/11/2018
 
Toll-like receptor 7
Name:Toll-like receptor 7
Type:Enzyme
Mol. Mass.:120945.35
Organism:Homo sapiens (Human)
Description:Q9NYK1
Residue:1049
BDBM273784
NameBDBM273784
Synonyms:US10071079, Example 570 | US10478424, Example 570
TypeSmall organic molecule
Emp. Form.C26H34N6O
Mol. Mass.446.5878
SMILESCNCCN1CCC(CC1)c1ccc2[nH]c(c(C(C)C)c2c1)-c1cc(OC)c2ncnn2c1