Reaction Details
TargetToll-like receptor 9
LigandBDBM273855
Substrate/Competitorn/a
Meas. Tech.TLR7/8/9 Inhibition Reporter Assay
Temperature298.15±n/a K
IC50 1067±n/a nM
Commentsextracted
Citation Dyckman, AJDodd, DSMacor, JEMussari, CPPasunoori, LKumar, SRSherwood, TCSistla, RK [1,2,4]triazolo[1,5-a]pyridinyl substituted indole compounds US Patent US10071079 Publication Date 9/11/2018
 
Toll-like receptor 9
Name:Toll-like receptor 9
Type:Enzyme
Mol. Mass.:115889.91
Organism:Homo sapiens (Human)
Description:Q9NR96
Residue:1032
BDBM273855
NameBDBM273855
Synonyms:US10071079, Example 641 | US10478424, Example 641
TypeSmall organic molecule
Emp. Form.C26H29F3N6O
Mol. Mass.498.5433
SMILESCNCC(=O)N1CCC(CC1)c1ccc2[nH]c(c(C(C)C)c2c1)-c1cc(c2ncnn2c1)C(F)(F)F