Reaction Details
TargetToll-like receptor 7
LigandBDBM274078
Substrate/Competitorn/a
Meas. Tech.TLR7/8/9 Inhibition Reporter Assay
Temperature298.15±n/a K
IC50 0.400±n/a nM
Commentsextracted
Citation Dyckman, AJDodd, DSMacor, JEMussari, CPPasunoori, LKumar, SRSherwood, TCSistla, RK [1,2,4]triazolo[1,5-a]pyridinyl substituted indole compounds US Patent US10071079 Publication Date 9/11/2018
 
Toll-like receptor 7
Name:Toll-like receptor 7
Type:Enzyme
Mol. Mass.:120945.35
Organism:Homo sapiens (Human)
Description:Q9NYK1
Residue:1049
BDBM274078
NameBDBM274078
Synonyms:US10071079, Example 864 | US10478424, Example 864
TypeSmall organic molecule
Emp. Form.C28H33FN6O2
Mol. Mass.504.599
SMILESCOc1cc(cn2ncnc12)-c1[nH]c2ccc(cc2c1C(C)C)C1CCN(CC(=O)N2CC(F)C2)CC1