Reaction Details
TargetToll-like receptor 7
LigandBDBM274105
Substrate/Competitorn/a
Meas. Tech.TLR7/8/9 Inhibition Reporter Assay
Temperature298.15±n/a K
IC50 0.200±n/a nM
Commentsextracted
Citation Dyckman, AJDodd, DSMacor, JEMussari, CPPasunoori, LKumar, SRSherwood, TCSistla, RK [1,2,4]triazolo[1,5-a]pyridinyl substituted indole compounds US Patent US10071079 Publication Date 9/11/2018
 
Toll-like receptor 7
Name:Toll-like receptor 7
Type:Enzyme
Mol. Mass.:120945.35
Organism:Homo sapiens (Human)
Description:Q9NYK1
Residue:1049
BDBM274105
NameBDBM274105
Synonyms:US10071079, Example 891 | US10478424, Example 891
TypeSmall organic molecule
Emp. Form.C29H37N7O2
Mol. Mass.515.6498
SMILESCC(C)c1c([nH]c2ccc(cc12)C1CCN(CC1)C(=O)CCNCC(N)=O)-c1cn2ncnc2c(C)c1C